{"text_format":"1","workbook":"xlsx","n_sheets":5,"sheets":["svod","model","Лист1","Unique","nom"],"not_rendered":{"charts":0,"images":18,"macros":1,"external_links":0,"defined_names":25,"comments":0,"pivot_tables":0},"unopened":[],"bounds":{"document_bytes":16777216,"sheet_cells":100000,"rows_first":2000,"rows_last":500,"rows_between":2000,"halvings":0,"cell_chars":16384,"cell_head_chars":4096},"cells_cut":0,"cells_raw":0,"read":"whole","date_system":"1900"}

{"sheet":"svod","index":0,"n_rows":30,"n_cols":22,"rows_kept":30,"cut":false,"hidden":false,"merged":[[14,13,15,13],[14,14,15,15],[14,11,15,12],[6,3,6,4],[26,1,26,2],[18,3,18,4],[23,1,23,2],[24,1,24,2],[25,1,25,2]]}
[null,null,null,null,null,null,null,null,null,null,null,null,null,null,null,null,null,null,null,null,null,true]
[null,null,null,null,null,null,null,null,null,null,null,null,null,null,null,null,null,null,null,null,null,false]
[null,null,null,null,null,null,null,null,null,null,null,null,null,null,null,null,null,null,null,null,null,"Ribbon"]
[null,null,null,null,""]
[]
[]
{"$rows_left_out":25}
{"sheet":"model","index":1,"n_rows":50,"n_cols":27,"rows_kept":50,"cut":false,"hidden":true,"merged":[]}
["Model",null,"Высота","Ширина","Глубина","Каркас","Боковые панели","Вертикальный профиль","Вертикальный П-образный профиль","Монтажные платы1","Монтажные платы2","Монтажные платы3","Монтажные платы4","Монтажные платы5","Монтажные платы6","Монтажные платы7","Рейки монтажные","Панели под ППН","Цоколь",null,"Model","N",null,"N","Кол-ва","Артикул","Цвет"]
[{"$f":"INDEX(Unique!$A$2:$B$10,MATCH(B3,Unique!$B$2:$B$10,0),1)","v":"-"},1,{"$f":"INDEX(Unique!$C$2:$D$5,MATCH(C3,Unique!$D$2:$D$5,0),1)","v":"-"},{"$f":"INDEX(Unique!$E$2:$F$5,MATCH(D3,Unique!$F$2:$F$5,0),1)","v":"-"},{"$f":"INDEX(Unique!$G$2:$H$5,MATCH(E3,Unique!$H$2:$H$5,0),1)","v":"-"},{"$f":"IFERROR(INDEX(Unique!$I$2:$J$21,MATCH(F3,Unique!$J$2:$J$21,0),1),0)","v":"-"},{"$f":"IFERROR(INDEX(Unique!$K$2:$L$21,MATCH(G3,Unique!$L$2:$L$21,0),1),0)","v":"-"},{"$f":"INDEX(Unique!$M$2:$N$5,MATCH(H3,Unique!$N$2:$N$5,0),1)","v":"-"},{"$f":"IFERROR(INDEX(Unique!$O$2:$P$5,MATCH(I3,Unique!$P$2:$P$5,0),1),0)","v":"-"},{"$f":"IFERROR(INDEX(Unique!$Q$2:$R$5,MATCH(J3,Unique!$R$2:$R$5,0),1),0)","v":"-"},{"$f":"IFERROR(INDEX(Unique!$S$2:$T$5,MATCH(K3,Unique!$T$2:$T$5,0),1),0)","v":"-"},{"$f":"IFERROR(INDEX(Unique!$U$2:$V$5,MATCH(L3,Unique!$V$2:$V$5,0),1),0)","v":"-"},{"$f":"IFERROR(INDEX(Unique!$W$2:$X$5,MATCH(M3,Unique!$X$2:$X$5,0),1),0)","v":"-"},{"$f":"IFERROR(INDEX(Unique!$Y$2:$Z$5,MATCH(N3,Unique!$Z$2:$Z$5,0),1),0)","v":"-"},{"$f":"IFERROR(INDEX(Unique!$AA$2:$AB$5,MATCH(O3,Unique!$AB$2:$AB$5,0),1),0)","v":"-"},{"$f":"IFERROR(INDEX(Unique!$AC$2:$AD$5,MATCH(P3,Unique!$AD$2:$AD$5,0),1),0)","v":"-"},{"$f":"IFERROR(INDEX(Unique!$AE$2:$AF$5,MATCH(Q3,Unique!$AF$2:$AF$5,0),1),0)","v":"-"},{"$f":"IFERROR(INDEX(Unique!$AG$2:$AH$5,MATCH(R3,Unique!$AH$2:$AH$5,0),1),0)","v":"-"},{"$f":"IFERROR(INDEX(Unique!$AI$2:$AJ$5,MATCH(R3,Unique!$AJ$2:$AJ$5,0),1),0)","v":"-"},null,"-",1,null,1,"",{"$f":"IF(AND(Y2<>\"\",Y2<>0),F$2,\"0\")","v":"0"},24]
["N",1,1,1,1,1,1,1,1,1,1,1,1,1,1,1,1,1,1,null,"ВРУ-1 R разборный IP31",2,null,2,"",{"$f":"IF(AND(Y3<>\"\",Y3<>0),G$2,\"0\")","v":"0"}]
[{"$f":"A1","v":"Model"},"N","Height","Width","Depth","Frame","Panel","Profile","PProfil","Plate1","Plate2","Plate3","Plate4","Plate5","Plate6","Plate7","Rail","PanelPPN","Cokol",null,"ВРУ-1 S сварной IP31",3,null,3,"",{"$f":"IF(AND(Y4<>\"\",Y4<>0),H$2,\"0\")","v":"0"}]
["-",null,"-","-","-","-","-","-","-","-","-","-","-","-","-","-","-","-","-",null,"ВРУ-1 S сварной IP54",4,null,4,"",{"$f":"IF(AND(Y5<>\"\",Y5<>0),I$2,\"0\")","v":"0"}]
["ВРУ-1 R разборный IP31",null,2000,800,450,"mb09-01-06","mb09-03-02","mb15-04-05","-","mb15-08-01-02","mb15-08-02-01","mb15-08-01-06","mb15-08-01-02s","mb15-08-02-01s","mb15-08-01-06s","mb15-18-71s","mb15-06-02","mb15-08-01-09","-",null,"ЩО-70 Unit",5,null,5,"",{"$f":"IF(AND(Y6<>\"\",Y6<>0),J$2,\"0\")","v":"0"}]
{"$rows_left_out":45}
{"sheet":"Лист1","index":2,"n_rows":0,"n_cols":0,"rows_kept":0,"cut":false,"hidden":true,"merged":[]}

{"sheet":"Unique","index":3,"n_rows":18,"n_cols":50,"rows_kept":18,"cut":false,"hidden":true,"merged":[[2,36,3,43]]}
[{"$f":"model!A4","v":"Model"},"№",{"$f":"model!C4","v":"Height"},"№",{"$f":"model!D4","v":"Width"},"№",{"$f":"model!E4","v":"Depth"},"№",{"$f":"model!F4","v":"Frame"},"№",{"$f":"model!G4","v":"Panel"},"№",{"$f":"model!H4","v":"Profile"},"№",{"$f":"model!I4","v":"PProfil"},"№",{"$f":"model!J4","v":"Plate1"},"№",{"$f":"model!K4","v":"Plate2"},"№",{"$f":"model!L4","v":"Plate3"},"№",{"$f":"model!M4","v":"Plate4"},"№",{"$f":"model!N4","v":"Plate5"},"№",{"$f":"model!O4","v":"Plate6"},"№",{"$f":"model!P4","v":"Plate7"},"№",{"$f":"model!Q4","v":"Rail"},"№",{"$f":"model!R4","v":"PanelPPN"},"№",{"$f":"model!S4","v":"Cokol"},"№",null,"Art","Номенклатура","Количество",null,null,null,null,null,null,null,null,null,30]
[{"$f":"INDEX(Model,MATCH(0,COUNTIF($A$1:A1,Model),0))","v":"-"},1,{"$f":"INDEX(Height,MATCH(0,COUNTIF($C$1:C1,Height)+(Model<>model!$A$2),0))","v":"-"},1,{"$f":"INDEX(Width,MATCH(0,COUNTIF($E$1:E1,Width)+(Model<>model!$A$2)+(Height<>model!$C$2),0))","v":"-"},1,{"$f":"INDEX(Depth,MATCH(0,COUNTIF($G$1:G1,Depth)+(Model<>model!$A$2)+(Height<>model!$C$2)+(Width<>model!$D$2),0))","v":"-"},1,{"$f":"INDEX(Frame,MATCH(0,COUNTIF($I$1:I1,Frame)+(Model<>model!$A$2)+(Height<>model!$C$2)+(Width<>model!$D$2)+(Depth<>model!$E$2),0))","v":"-"},1,{"$f":"INDEX(Panel,MATCH(0,COUNTIF($K$1:K1,Panel)+(Model<>model!$A$2)+(Height<>model!$C$2)+(Width<>model!$D$2)+(Depth<>model!$E$2),0))","v":"-"},1,{"$f":"INDEX(Profile,MATCH(0,COUNTIF($M$1:M1,Profile)+(Model<>model!$A$2)+(Height<>model!$C$2)+(Width<>model!$D$2)+(Depth<>model!$E$2),0))","v":"-"},1,{"$f":"INDEX(PProfil,MATCH(0,COUNTIF($O$1:O1,PProfil)+(Model<>model!$A$2)+(Height<>model!$C$2)+(Width<>model!$D$2)+(Depth<>model!$E$2),0))","v":"-"},1,{"$f":"INDEX(Plate1,MATCH(0,COUNTIF($Q$1:Q1,Plate1)+(Model<>model!$A$2)+(Height<>model!$C$2)+(Width<>model!$D$2)+(Depth<>model!$E$2),0))","v":"-"},1,{"$f":"INDEX(Plate2,MATCH(0,COUNTIF($S$1:S1,Plate2)+(Model<>model!$A$2)+(Height<>model!$C$2)+(Width<>model!$D$2)+(Depth<>model!$E$2),0))","v":"-"},1,{"$f":"INDEX(Plate3,MATCH(0,COUNTIF($U$1:U1,Plate3)+(Model<>model!$A$2)+(Height<>model!$C$2)+(Width<>model!$D$2)+(Depth<>model!$E$2),0))","v":"-"},1,{"$f":"INDEX(Plate4,MATCH(0,COUNTIF($W$1:W1,Plate4)+(Model<>model!$A$2)+(Height<>model!$C$2)+(Width<>model!$D$2)+(Depth<>model!$E$2),0))","v":"-"},1,{"$f":"INDEX(Plate5,MATCH(0,COUNTIF($Y$1:Y1,Plate5)+(Model<>model!$A$2)+(Height<>model!$C$2)+(Width<>model!$D$2)+(Depth<>model!$E$2),0))","v":"-"},1,{"$f":"INDEX(Plate6,MATCH(0,COUNTIF($AA$1:AA1,Plate6)+(Model<>model!$A$2)+(Height<>model!$C$2)+(Width<>model!$D$2)+(Depth<>model!$E$2),0))","v":"-"},1,{"$f":"INDEX(Plate7,MATCH(0,COUNTIF($AC$1:AC1,Plate7)+(Model<>model!$A$2)+(Height<>model!$C$2)+(Width<>model!$D$2)+(Depth<>model!$E$2),0))","v":"-"},1,{"$f":"INDEX(Rail,MATCH(0,COUNTIF($AE$1:AE1,Rail)+(Model<>model!$A$2)+(Height<>model!$C$2)+(Width<>model!$D$2)+(Depth<>model!$E$2),0))","v":"-"},1,{"$f":"INDEX(PanelPPN,MATCH(0,COUNTIF($AG$1:AG1,PanelPPN)+(Model<>model!$A$2)+(Height<>model!$C$2)+(Width<>model!$D$2)+(Depth<>model!$E$2),0))","v":"-"},1,{"$f":"INDEX(Cokol,MATCH(0,COUNTIF($AI$1:AI1,Cokol)+(Model<>model!$A$2)+(Height<>model!$C$2)+(Width<>model!$D$2)+(Depth<>model!$E$2),0))","v":"-"},1,null,{"$f":"model!F2","v":"-"},{"$f":"IFERROR(VLOOKUP(AL2,nom!A:B,2,0),\"\")","v":""},{"$f":"model!Y2","v":""},null,null,null,null,null,null,null,null,null,30]
["ВРУ-1 R разборный IP31",2,{"$f":"INDEX(Height,MATCH(0,COUNTIF($C$1:C2,Height)+(Model<>model!$A$2),0))","v":{"$error":"#N/A"}},2,{"$f":"INDEX(Width,MATCH(0,COUNTIF($E$1:E2,Width)+(Model<>model!$A$2)+(Height<>model!$C$2),0))","v":{"$error":"#N/A"}},2,{"$f":"INDEX(Depth,MATCH(0,COUNTIF($G$1:G2,Depth)+(Model<>model!$A$2)+(Height<>model!$C$2)+(Width<>model!$D$2),0))","v":{"$error":"#N/A"}},2,{"$f":"INDEX(Frame,MATCH(0,COUNTIF($I$1:I2,Frame)+(Model<>model!$A$2)+(Height<>model!$C$2)+(Width<>model!$D$2)+(Depth<>model!$E$2),0))","v":{"$error":"#N/A"}},2,{"$f":"INDEX(Panel,MATCH(0,COUNTIF($K$1:K2,Panel)+(Model<>model!$A$2)+(Height<>model!$C$2)+(Width<>model!$D$2)+(Depth<>model!$E$2),0))","v":{"$error":"#N/A"}},2,{"$f":"INDEX(Profile,MATCH(0,COUNTIF($M$1:M2,Profile)+(Model<>model!$A$2)+(Height<>model!$C$2)+(Width<>model!$D$2)+(Depth<>model!$E$2),0))","v":{"$error":"#N/A"}},2,{"$f":"INDEX(PProfil,MATCH(0,COUNTIF($O$1:O2,PProfil)+(Model<>model!$A$2)+(Height<>model!$C$2)+(Width<>model!$D$2)+(Depth<>model!$E$2),0))","v":{"$error":"#N/A"}},2,{"$f":"INDEX(Plate1,MATCH(0,COUNTIF($Q$1:Q2,Plate1)+(Model<>model!$A$2)+(Height<>model!$C$2)+(Width<>model!$D$2)+(Depth<>model!$E$2),0))","v":{"$error":"#N/A"}},2,{"$f":"INDEX(Plate2,MATCH(0,COUNTIF($S$1:S2,Plate2)+(Model<>model!$A$2)+(Height<>model!$C$2)+(Width<>model!$D$2)+(Depth<>model!$E$2),0))","v":{"$error":"#N/A"}},2,{"$f":"INDEX(Plate3,MATCH(0,COUNTIF($U$1:U2,Plate3)+(Model<>model!$A$2)+(Height<>model!$C$2)+(Width<>model!$D$2)+(Depth<>model!$E$2),0))","v":{"$error":"#N/A"}},2,{"$f":"INDEX(Plate4,MATCH(0,COUNTIF($W$1:W2,Plate4)+(Model<>model!$A$2)+(Height<>model!$C$2)+(Width<>model!$D$2)+(Depth<>model!$E$2),0))","v":{"$error":"#N/A"}},2,{"$f":"INDEX(Plate5,MATCH(0,COUNTIF($Y$1:Y2,Plate5)+(Model<>model!$A$2)+(Height<>model!$C$2)+(Width<>model!$D$2)+(Depth<>model!$E$2),0))","v":{"$error":"#N/A"}},2,{"$f":"INDEX(Plate6,MATCH(0,COUNTIF($AA$1:AA2,Plate6)+(Model<>model!$A$2)+(Height<>model!$C$2)+(Width<>model!$D$2)+(Depth<>model!$E$2),0))","v":{"$error":"#N/A"}},2,{"$f":"INDEX(Plate7,MATCH(0,COUNTIF($AC$1:AC2,Plate7)+(Model<>model!$A$2)+(Height<>model!$C$2)+(Width<>model!$D$2)+(Depth<>model!$E$2),0))","v":{"$error":"#N/A"}},2,{"$f":"INDEX(Rail,MATCH(0,COUNTIF($AE$1:AE2,Rail)+(Model<>model!$A$2)+(Height<>model!$C$2)+(Width<>model!$D$2)+(Depth<>model!$E$2),0))","v":{"$error":"#N/A"}},2,{"$f":"INDEX(PanelPPN,MATCH(0,COUNTIF($AG$1:AG2,PanelPPN)+(Model<>model!$A$2)+(Height<>model!$C$2)+(Width<>model!$D$2)+(Depth<>model!$E$2),0))","v":{"$error":"#N/A"}},2,{"$f":"INDEX(Cokol,MATCH(0,COUNTIF($AI$1:AI2,Cokol)+(Model<>model!$A$2)+(Height<>model!$C$2)+(Width<>model!$D$2)+(Depth<>model!$E$2),0))","v":{"$error":"#N/A"}},2,"Дополнительное оборудование",null,null,null,null,null,null,null,null,null,null,null,null,25]
["ВРУ-1 S сварной IP31",3,{"$f":"INDEX(Height,MATCH(0,COUNTIF($C$1:C3,Height)+(Model<>model!$A$2),0))","v":{"$error":"#N/A"}},3,{"$f":"INDEX(Width,MATCH(0,COUNTIF($E$1:E3,Width)+(Model<>model!$A$2)+(Height<>model!$C$2),0))","v":{"$error":"#N/A"}},3,{"$f":"INDEX(Depth,MATCH(0,COUNTIF($G$1:G3,Depth)+(Model<>model!$A$2)+(Height<>model!$C$2)+(Width<>model!$D$2),0))","v":{"$error":"#N/A"}},3,{"$f":"INDEX(Frame,MATCH(0,COUNTIF($I$1:I3,Frame)+(Model<>model!$A$2)+(Height<>model!$C$2)+(Width<>model!$D$2)+(Depth<>model!$E$2),0))","v":{"$error":"#N/A"}},3,{"$f":"INDEX(Panel,MATCH(0,COUNTIF($K$1:K3,Panel)+(Model<>model!$A$2)+(Height<>model!$C$2)+(Width<>model!$D$2)+(Depth<>model!$E$2),0))","v":{"$error":"#N/A"}},3,{"$f":"INDEX(Profile,MATCH(0,COUNTIF($M$1:M3,Profile)+(Model<>model!$A$2)+(Height<>model!$C$2)+(Width<>model!$D$2)+(Depth<>model!$E$2),0))","v":{"$error":"#N/A"}},3,{"$f":"INDEX(PProfil,MATCH(0,COUNTIF($O$1:O3,PProfil)+(Model<>model!$A$2)+(Height<>model!$C$2)+(Width<>model!$D$2)+(Depth<>model!$E$2),0))","v":{"$error":"#N/A"}},3,{"$f":"INDEX(Plate1,MATCH(0,COUNTIF($Q$1:Q3,Plate1)+(Model<>model!$A$2)+(Height<>model!$C$2)+(Width<>model!$D$2)+(Depth<>model!$E$2),0))","v":{"$error":"#N/A"}},3,{"$f":"INDEX(Plate2,MATCH(0,COUNTIF($S$1:S3,Plate2)+(Model<>model!$A$2)+(Height<>model!$C$2)+(Width<>model!$D$2)+(Depth<>model!$E$2),0))","v":{"$error":"#N/A"}},3,{"$f":"INDEX(Plate3,MATCH(0,COUNTIF($U$1:U3,Plate3)+(Model<>model!$A$2)+(Height<>model!$C$2)+(Width<>model!$D$2)+(Depth<>model!$E$2),0))","v":{"$error":"#N/A"}},3,{"$f":"INDEX(Plate4,MATCH(0,COUNTIF($W$1:W3,Plate4)+(Model<>model!$A$2)+(Height<>model!$C$2)+(Width<>model!$D$2)+(Depth<>model!$E$2),0))","v":{"$error":"#N/A"}},3,{"$f":"INDEX(Plate5,MATCH(0,COUNTIF($Y$1:Y3,Plate5)+(Model<>model!$A$2)+(Height<>model!$C$2)+(Width<>model!$D$2)+(Depth<>model!$E$2),0))","v":{"$error":"#N/A"}},3,{"$f":"INDEX(Plate6,MATCH(0,COUNTIF($AA$1:AA3,Plate6)+(Model<>model!$A$2)+(Height<>model!$C$2)+(Width<>model!$D$2)+(Depth<>model!$E$2),0))","v":{"$error":"#N/A"}},3,{"$f":"INDEX(Plate7,MATCH(0,COUNTIF($AC$1:AC3,Plate7)+(Model<>model!$A$2)+(Height<>model!$C$2)+(Width<>model!$D$2)+(Depth<>model!$E$2),0))","v":{"$error":"#N/A"}},3,{"$f":"INDEX(Rail,MATCH(0,COUNTIF($AE$1:AE3,Rail)+(Model<>model!$A$2)+(Height<>model!$C$2)+(Width<>model!$D$2)+(Depth<>model!$E$2),0))","v":{"$error":"#N/A"}},3,{"$f":"INDEX(PanelPPN,MATCH(0,COUNTIF($AG$1:AG3,PanelPPN)+(Model<>model!$A$2)+(Height<>model!$C$2)+(Width<>model!$D$2)+(Depth<>model!$E$2),0))","v":{"$error":"#N/A"}},3,{"$f":"INDEX(Cokol,MATCH(0,COUNTIF($AI$1:AI3,Cokol)+(Model<>model!$A$2)+(Height<>model!$C$2)+(Width<>model!$D$2)+(Depth<>model!$E$2),0))","v":{"$error":"#N/A"}},3,null,null,null,null,null,null,null,null,null,null,null,null,null,20]
["ВРУ-1 S сварной IP54",4,{"$f":"INDEX(Height,MATCH(0,COUNTIF($C$1:C4,Height)+(Model<>model!$A$2),0))","v":{"$error":"#N/A"}},4,{"$f":"INDEX(Width,MATCH(0,COUNTIF($E$1:E4,Width)+(Model<>model!$A$2)+(Height<>model!$C$2),0))","v":{"$error":"#N/A"}},4,{"$f":"INDEX(Depth,MATCH(0,COUNTIF($G$1:G4,Depth)+(Model<>model!$A$2)+(Height<>model!$C$2)+(Width<>model!$D$2),0))","v":{"$error":"#N/A"}},4,{"$f":"INDEX(Frame,MATCH(0,COUNTIF($I$1:I4,Frame)+(Model<>model!$A$2)+(Height<>model!$C$2)+(Width<>model!$D$2)+(Depth<>model!$E$2),0))","v":{"$error":"#N/A"}},4,{"$f":"INDEX(Panel,MATCH(0,COUNTIF($K$1:K4,Panel)+(Model<>model!$A$2)+(Height<>model!$C$2)+(Width<>model!$D$2)+(Depth<>model!$E$2),0))","v":{"$error":"#N/A"}},4,{"$f":"INDEX(Profile,MATCH(0,COUNTIF($M$1:M4,Profile)+(Model<>model!$A$2)+(Height<>model!$C$2)+(Width<>model!$D$2)+(Depth<>model!$E$2),0))","v":{"$error":"#N/A"}},4,{"$f":"INDEX(PProfil,MATCH(0,COUNTIF($O$1:O4,PProfil)+(Model<>model!$A$2)+(Height<>model!$C$2)+(Width<>model!$D$2)+(Depth<>model!$E$2),0))","v":{"$error":"#N/A"}},4,{"$f":"INDEX(Plate1,MATCH(0,COUNTIF($Q$1:Q4,Plate1)+(Model<>model!$A$2)+(Height<>model!$C$2)+(Width<>model!$D$2)+(Depth<>model!$E$2),0))","v":{"$error":"#N/A"}},4,{"$f":"INDEX(Plate2,MATCH(0,COUNTIF($S$1:S4,Plate2)+(Model<>model!$A$2)+(Height<>model!$C$2)+(Width<>model!$D$2)+(Depth<>model!$E$2),0))","v":{"$error":"#N/A"}},4,{"$f":"INDEX(Plate3,MATCH(0,COUNTIF($U$1:U4,Plate3)+(Model<>model!$A$2)+(Height<>model!$C$2)+(Width<>model!$D$2)+(Depth<>model!$E$2),0))","v":{"$error":"#N/A"}},4,{"$f":"INDEX(Plate4,MATCH(0,COUNTIF($W$1:W4,Plate4)+(Model<>model!$A$2)+(Height<>model!$C$2)+(Width<>model!$D$2)+(Depth<>model!$E$2),0))","v":{"$error":"#N/A"}},4,{"$f":"INDEX(Plate5,MATCH(0,COUNTIF($Y$1:Y4,Plate5)+(Model<>model!$A$2)+(Height<>model!$C$2)+(Width<>model!$D$2)+(Depth<>model!$E$2),0))","v":{"$error":"#N/A"}},4,{"$f":"INDEX(Plate6,MATCH(0,COUNTIF($AA$1:AA4,Plate6)+(Model<>model!$A$2)+(Height<>model!$C$2)+(Width<>model!$D$2)+(Depth<>model!$E$2),0))","v":{"$error":"#N/A"}},4,{"$f":"INDEX(Plate7,MATCH(0,COUNTIF($AC$1:AC4,Plate7)+(Model<>model!$A$2)+(Height<>model!$C$2)+(Width<>model!$D$2)+(Depth<>model!$E$2),0))","v":{"$error":"#N/A"}},4,{"$f":"INDEX(Rail,MATCH(0,COUNTIF($AE$1:AE4,Rail)+(Model<>model!$A$2)+(Height<>model!$C$2)+(Width<>model!$D$2)+(Depth<>model!$E$2),0))","v":{"$error":"#N/A"}},4,{"$f":"INDEX(PanelPPN,MATCH(0,COUNTIF($AG$1:AG4,PanelPPN)+(Model<>model!$A$2)+(Height<>model!$C$2)+(Width<>model!$D$2)+(Depth<>model!$E$2),0))","v":{"$error":"#N/A"}},4,{"$f":"INDEX(Cokol,MATCH(0,COUNTIF($AI$1:AI4,Cokol)+(Model<>model!$A$2)+(Height<>model!$C$2)+(Width<>model!$D$2)+(Depth<>model!$E$2),0))","v":{"$error":"#N/A"}},4,null,{"$f":"IFERROR(INDEX(model!$Z$3:$Z$15,MATCH(1,COUNTIF($AL$4:AL4,model!$Z$3:$Z$15)+(model!$Z$3:$Z$15<>\"0\"),0)),\"\")","v":""},{"$f":"IFERROR(VLOOKUP(AL5,nom!A:B,2,0),\"\")","v":""},{"$f":"IFERROR(INDEX(model!$Y$3:$Z$15,MATCH(Unique!AL5,model!$Z$3:$Z$15,0),1),\"\")","v":""},null,null,null,null,null,null,null,null,null,15]
["ВРУ-2 S сварной IP31",5,{"$f":"INDEX(Height,MATCH(0,COUNTIF($C$1:C5,Height)+(Model<>model!$A$2),0))","v":{"$error":"#N/A"}},5,{"$f":"INDEX(Width,MATCH(0,COUNTIF($E$1:E5,Width)+(Model<>model!$A$2)+(Height<>model!$C$2),0))","v":{"$error":"#N/A"}},5,{"$f":"INDEX(Depth,MATCH(0,COUNTIF($G$1:G5,Depth)+(Model<>model!$A$2)+(Height<>model!$C$2)+(Width<>model!$D$2),0))","v":{"$error":"#N/A"}},5,{"$f":"INDEX(Frame,MATCH(0,COUNTIF($I$1:I5,Frame)+(Model<>model!$A$2)+(Height<>model!$C$2)+(Width<>model!$D$2)+(Depth<>model!$E$2),0))","v":{"$error":"#N/A"}},5,{"$f":"INDEX(Panel,MATCH(0,COUNTIF($K$1:K5,Panel)+(Model<>model!$A$2)+(Height<>model!$C$2)+(Width<>model!$D$2)+(Depth<>model!$E$2),0))","v":{"$error":"#N/A"}},5,{"$f":"INDEX(Profile,MATCH(0,COUNTIF($M$1:M5,Profile)+(Model<>model!$A$2)+(Height<>model!$C$2)+(Width<>model!$D$2)+(Depth<>model!$E$2),0))","v":{"$error":"#N/A"}},5,{"$f":"INDEX(PProfil,MATCH(0,COUNTIF($O$1:O5,PProfil)+(Model<>model!$A$2)+(Height<>model!$C$2)+(Width<>model!$D$2)+(Depth<>model!$E$2),0))","v":{"$error":"#N/A"}},5,{"$f":"INDEX(Plate1,MATCH(0,COUNTIF($Q$1:Q5,Plate1)+(Model<>model!$A$2)+(Height<>model!$C$2)+(Width<>model!$D$2)+(Depth<>model!$E$2),0))","v":{"$error":"#N/A"}},5,{"$f":"INDEX(Plate2,MATCH(0,COUNTIF($S$1:S5,Plate2)+(Model<>model!$A$2)+(Height<>model!$C$2)+(Width<>model!$D$2)+(Depth<>model!$E$2),0))","v":{"$error":"#N/A"}},5,{"$f":"INDEX(Plate3,MATCH(0,COUNTIF($U$1:U5,Plate3)+(Model<>model!$A$2)+(Height<>model!$C$2)+(Width<>model!$D$2)+(Depth<>model!$E$2),0))","v":{"$error":"#N/A"}},5,{"$f":"INDEX(Plate4,MATCH(0,COUNTIF($W$1:W5,Plate4)+(Model<>model!$A$2)+(Height<>model!$C$2)+(Width<>model!$D$2)+(Depth<>model!$E$2),0))","v":{"$error":"#N/A"}},5,{"$f":"INDEX(Plate5,MATCH(0,COUNTIF($Y$1:Y5,Plate5)+(Model<>model!$A$2)+(Height<>model!$C$2)+(Width<>model!$D$2)+(Depth<>model!$E$2),0))","v":{"$error":"#N/A"}},5,{"$f":"INDEX(Plate6,MATCH(0,COUNTIF($AA$1:AA5,Plate6)+(Model<>model!$A$2)+(Height<>model!$C$2)+(Width<>model!$D$2)+(Depth<>model!$E$2),0))","v":{"$error":"#N/A"}},5,{"$f":"INDEX(Plate7,MATCH(0,COUNTIF($AC$1:AC5,Plate7)+(Model<>model!$A$2)+(Height<>model!$C$2)+(Width<>model!$D$2)+(Depth<>model!$E$2),0))","v":{"$error":"#N/A"}},5,{"$f":"INDEX(Rail,MATCH(0,COUNTIF($AE$1:AE5,Rail)+(Model<>model!$A$2)+(Height<>model!$C$2)+(Width<>model!$D$2)+(Depth<>model!$E$2),0))","v":{"$error":"#N/A"}},5,{"$f":"INDEX(PanelPPN,MATCH(0,COUNTIF($AG$1:AG5,PanelPPN)+(Model<>model!$A$2)+(Height<>model!$C$2)+(Width<>model!$D$2)+(Depth<>model!$E$2),0))","v":{"$error":"#N/A"}},5,{"$f":"INDEX(Cokol,MATCH(0,COUNTIF($AI$1:AI5,Cokol)+(Model<>model!$A$2)+(Height<>model!$C$2)+(Width<>model!$D$2)+(Depth<>model!$E$2),0))","v":{"$error":"#N/A"}},5,null,{"$f":"IFERROR(INDEX(model!$Z$3:$Z$15,MATCH(1,COUNTIF($AL$4:AL5,model!$Z$3:$Z$15)+(model!$Z$3:$Z$15<>\"0\"),0)),\"\")","v":""},{"$f":"IFERROR(VLOOKUP(AL6,nom!A:B,2,0),\"\")","v":""},{"$f":"IFERROR(INDEX(model!$Y$3:$Z$15,MATCH(Unique!AL6,model!$Z$3:$Z$15,0),1),\"\")","v":""}]
{"$rows_left_out":13}
{"sheet":"nom","index":4,"n_rows":107,"n_cols":4,"rows_kept":107,"cut":false,"hidden":true,"merged":[]}
["Артикул","Номенклатура","Высота платы","Номер рисунка"]
["mb09-01-01","Каркас ВРУ-1 Unit R разборный (1800х450х450)  IP31 EKF PROxima",null,1]
["mb09-01-02","Каркас ВРУ-1 Unit R разборный (1800х600х450)  IP31 EKF PROxima",null,1]
["mb09-01-03","Каркас ВРУ-1 Unit R разборный (1800х800х450)  IP31 EKF PROxima",null,1]
["mb09-01-04","Каркас ВРУ-1 Unit R разборный (2000х450х450)  IP31 EKF PROxima",null,1]
["mb09-01-05","Каркас ВРУ-1 Unit R разборный (2000х600х450)  IP31 EKF PROxima",null,1]
{"$rows_left_out":101}